Department Family,Entity,Date,Expense Type,Expense Area,Supplier,Transaction Number,AP Amount,Description,Supplier Postcode,Supplier type,Contract Number,Project code,Expenditure type,VAT Registration Number,Purchase Invoice Number
Department of Health,Solent NHS Trust,30/06/2021,Voluntary Sector,Veterans MH HIS,ALL CALL SIGNS GROUP (THE),38498267,"�33,189.78",All Call Signs,PO5 2SJ, , , , ,,907
Department of Health,Solent NHS Trust,30/06/2021,Med & Surg Maint Contract,Estates & Facilities Management,BCAS BIOMEDICAL SERVICES LTD,38610709,"�23,578.83",Maintenance Contract - 01/06/21 - 30/06/2021,HP13 5SH, , , , ,861519124,14250
Department of Health,Solent NHS Trust,30/06/2021,Drugs,Termination of Pregnancy,BPAS,38606177,"�3,697.00",,CV37 9BF, , , , ,855924881,47383
Department of Health,Solent NHS Trust,30/06/2021,Interpreting services,Termination of Pregnancy,BPAS,38606177,�288.69,https://nww.einvoice-prod.sbs.nhs.uk:8179/invoicepdf/d409566e-7910-56df-888f-80eecfe7012f,CV37 9BF, , , , ,855924881,47383
Department of Health,Solent NHS Trust,30/06/2021,Other Clinical Costs,Termination of Pregnancy,BPAS,38606177,"�140,975.00",,CV37 9BF, , , , ,855924881,47383
Department of Health,Solent NHS Trust,30/06/2021,Minor Works,Tannersbrook Estates C19,BRYMOR CONTRACTORS LTD,38402688,"�16,751.20",Uplift PO 79248520 (Tannesbrook) (KW/KA),PO7 6XP, , , , ,459597186,B28521
Department of Health,Solent NHS Trust,30/06/2021,Minor Works,Tannersbrook Estates C19,BRYMOR CONTRACTORS LTD,38402688,"�13,028.39",Uplift to PO 79248520 - Maintenance Repairs & replacement works (Tannersbrook) (KW),PO7 6XP, , , , ,459597186,B28521
Department of Health,Solent NHS Trust,30/06/2021,AUC Additions,Balance Sheet,BRYMOR CONTRACTORS LTD,38457644,"�28,280.24",PO UPLIFT  79243952   Hawthorns Orchards Dining extension  Brymor Construction Works,PO7 6XP, , , , ,459597186,B28528
Department of Health,Solent NHS Trust,30/06/2021,AUC Additions,Balance Sheet,BRYMOR CONTRACTORS LTD,38457644,"�92,908.92",UPLIFT ORDER 79243952 Hawthorn Ward - Adaptations and Extension,PO7 6XP, , , , ,459597186,B28528
Department of Health,Solent NHS Trust,30/06/2021,Computer Hardware Purch,ICT,CGI IT UK LTD,38423340,"�67,424.00",CCR553 WAN Replacement Milestone 1,CF31 9AP, , , , ,232615194,GB014058506
Department of Health,Solent NHS Trust,30/06/2021,OthrIntngAst Additions,Balance Sheet,CGI IT UK LTD,38513886,"�47,305.00",Windows 10 Phase 2 Call off PO to link to PO 79245086,CF31 9AP, , , , ,232615194,GB014060539
Department of Health,Solent NHS Trust,30/06/2021,Computer Maintenance,Vaccine Centre Soton,CGI IT UK LTD,38575306,"�65,000.00",Covid Vaccine Centre call off,CF31 9AP, , , , ,232615194,GB014060771
Department of Health,Solent NHS Trust,30/06/2021,Computer Hardware Purch,Dental OPG Machine,CGI IT UK LTD,38575307,"�22,119.00",CCR560 20200714 Part C Eastleigh Hub v0 7,CF31 9AP, , , , ,232615194,GB014060768
Department of Health,Solent NHS Trust,30/06/2021,Computer Hardware Purch,Dental OPG Machine,CGI IT UK LTD,38575307,"�4,423.80",https://nww.einvoice-prod.sbs.nhs.uk:8179/invoicepdf/50dda09c-6351-5bf6-af9a-2909a92e3453,CF31 9AP, , , , ,232615194,GB014060768
Department of Health,Solent NHS Trust,30/06/2021,OthrIntngAst Additions,Balance Sheet,CGI IT UK LTD,38634203,"�37,469.95",Cyber Security Enhancements,CF31 9AP, , , , ,232615194,GB014061038
Department of Health,Solent NHS Trust,30/06/2021,Computer Maintenance,Vaccine Centre IOW,CGI IT UK LTD,38634204,"�15,000.00",Covid Vaccine Centre call off PO 79252053,CF31 9AP, , , , ,232615194,GB014061039
Department of Health,Solent NHS Trust,30/06/2021,Computer Maintenance,Vaccine Centre North,CGI IT UK LTD,38634204,"�15,000.00",Covid Vaccine Centre call off PO 79252053,CF31 9AP, , , , ,232615194,GB014061039
Department of Health,Solent NHS Trust,30/06/2021,Computer Maintenance,Vaccine Centre Ports,CGI IT UK LTD,38634204,"�15,000.00",Covid Vaccine Centre call off PO 79252053,CF31 9AP, , , , ,232615194,GB014061039
Department of Health,Solent NHS Trust,30/06/2021,Computer Maintenance,Vaccine Centre Soton,CGI IT UK LTD,38634204,"�15,000.00",Covid Vaccine Centre call off PO 79252053,CF31 9AP, , , , ,232615194,GB014061039
Department of Health,Solent NHS Trust,30/06/2021,Contr Other External,CGI,CGI IT UK LTD,38687818,"�364,333.20",CGI Monthly Contract Charges 2021/2022 call off PO,CF31 9AP, , , , ,232615194,GB014061287
Department of Health,Solent NHS Trust,30/06/2021,Contr Other External,CGI,CGI IT UK LTD,38687835,"�67,543.82",Jun21 - CCR582 Additional Device \ User,CF31 9AP, , , , ,232615194,GB014061286
Department of Health,Solent NHS Trust,30/06/2021,Other Transport Costs,Non Patient Courier,CITYSPRINT (UK) LTD,38561644,"�47,240.63",https://nww.einvoice-prod.sbs.nhs.uk:8179/invoicepdf/5845ecc6-5955-5946-b61b-66159c11d628,RH1 1SH, , , , ,916381127,3654774B
Department of Health,Solent NHS Trust,30/06/2021,Lease Rents,Oak Park Childrens Centre,COMMUNITY HEALTH PARTNERSHIPS LTD,38402684,"�24,606.98",,M1 5AN, , , , ,GB782562113,60199009
Department of Health,Solent NHS Trust,30/06/2021,Service Charge,Oak Park Childrens Centre,COMMUNITY HEALTH PARTNERSHIPS LTD,38402684,"�4,040.64",https://nww.einvoice-prod.sbs.nhs.uk:8179/invoicepdf/6705da54-aceb-5c3d-b7eb-8303be47c129,M1 5AN, , , , ,GB782562113,60199009
Department of Health,Solent NHS Trust,30/06/2021,Lease Rents,Adelaide GP,COMMUNITY HEALTH PARTNERSHIPS LTD,38444724,"�7,018.78",,M1 5AN, , , , ,GB782562113,60199011
Department of Health,Solent NHS Trust,30/06/2021,Lease Rents,Adelaide Health Centre,COMMUNITY HEALTH PARTNERSHIPS LTD,38444724,"�141,738.70",,M1 5AN, , , , ,GB782562113,60199011
Department of Health,Solent NHS Trust,30/06/2021,Service Charge,Adelaide GP,COMMUNITY HEALTH PARTNERSHIPS LTD,38444724,"�1,432.10",https://nww.einvoice-prod.sbs.nhs.uk:8179/invoicepdf/2917b0a5-0f5b-5354-88ab-484b60f46a9b,M1 5AN, , , , ,GB782562113,60199011
Department of Health,Solent NHS Trust,30/06/2021,Service Charge,Adelaide Health Centre,COMMUNITY HEALTH PARTNERSHIPS LTD,38444724,"�28,920.16",,M1 5AN, , , , ,GB782562113,60199011
Department of Health,Solent NHS Trust,30/06/2021,SrvcsRecd-FoundationTrust,HIOW OH Wellbeing project,HAMPSHIRE HOSPITALS NHS FOUNDATION TRUST,38569167,"�37,890.00",4100 00000 00R1C NHS INCOME,WF3 1WE, , , , ,,40105319
Department of Health,Solent NHS Trust,30/06/2021,Laboratory External Tests,SRH North,HAMPSHIRE HOSPITALS NHS FOUNDATION TRUST,38659052,"�51,302.52",4100 00000 00R1C NHS INCOME,WF3 1WE, , , , ,,40105388
Department of Health,Solent NHS Trust,30/06/2021,Laboratory External Tests,SH Online Testing,HSL PATHOLOGY LLP,38423061,"�64,042.23",,WC1H 9AX, , , , ,225812813,IN003269
Department of Health,Solent NHS Trust,30/06/2021,Laboratory Test Kits,SH Online Testing,HSL PATHOLOGY LLP,38423061,"�2,960.50",http://nww.docserv.wyss.nhs.uk/synergyiim/dist/?val=3884919_14956571_20210513152145,WC1H 9AX, , , , ,225812813,IN003269
Department of Health,Solent NHS Trust,30/06/2021,Laboratory Test Kits,SH Online Testing,HSL PATHOLOGY LLP,38423061,"�14,802.48",,WC1H 9AX, , , , ,225812813,IN003269
Department of Health,Solent NHS Trust,30/06/2021,Contractual Clinical Srv,Specialist Physio,INHEALTH LTD,38533150,"�46,964.14",https://nww.einvoice-prod.sbs.nhs.uk:8179/invoicepdf/d5c1f0a7-f9a0-5f14-bbb9-668fc161d058,HP11 1JL, , , , ,787424685,IHLIN0031520
Department of Health,Solent NHS Trust,30/06/2021,Accruals - Current,Balance Sheet,INTERSERVE FACILITIES MANAGEMENT LTD,38394703,"�39,276.39",MITIE CONTRACT FOR 2021/2022,B37 7HQ, , , , ,527218256,FACMI052959
Department of Health,Solent NHS Trust,30/06/2021,Stocks Raw Materials,Balance Sheet,JANSSEN CILAG LTD,38485993,"�2,261.30",1 Syringe Pack PALIPERIDONE (TREVICTA) Pre-Filled Syringe 350mg,HP14 4HJ, , , , ,207929448,930753380
Department of Health,Solent NHS Trust,30/06/2021,Stocks Raw Materials,Balance Sheet,JANSSEN CILAG LTD,38485993,"�9,422.10",1 Syringe Pack PALIPERIDONE (XEPLION) Pre-Filled Syringe 100mg,HP14 4HJ, , , , ,207929448,930753380
Department of Health,Solent NHS Trust,30/06/2021,Stocks Raw Materials,Balance Sheet,JANSSEN CILAG LTD,38485993,"�7,066.62",1 Syringe Pack PALIPERIDONE (XEPLION) Pre-Filled Syringe 150mg,HP14 4HJ, , , , ,207929448,930753380
Department of Health,Solent NHS Trust,30/06/2021,Stocks Raw Materials,Balance Sheet,JANSSEN CILAG LTD,38485993,"�2,207.04",1 Syringe Pack PALIPERIDONE (XEPLION) Pre-Filled Syringe 50mg,HP14 4HJ, , , , ,207929448,930753380
Department of Health,Solent NHS Trust,30/06/2021,Stocks Raw Materials,Balance Sheet,JANSSEN CILAG LTD,38485993,"�2,938.80",1 Syringe Pack PALIPERIDONE (XEPLION) Pre-Filled Syringe 75mg,HP14 4HJ, , , , ,207929448,930753380
Department of Health,Solent NHS Trust,30/06/2021,Stocks Raw Materials,Balance Sheet,JANSSEN CILAG LTD,38485993,�478.14,1 Vial Pack RISPERIDONE Injection 25mg,HP14 4HJ, , , , ,207929448,930753380
Department of Health,Solent NHS Trust,30/06/2021,Stocks Raw Materials,Balance Sheet,JANSSEN CILAG LTD,38485993,�667.92,1 Vial Pack RISPERIDONE Injection 37.5mg,HP14 4HJ, , , , ,207929448,930753380
Department of Health,Solent NHS Trust,30/06/2021,Stocks Raw Materials,Balance Sheet,JANSSEN CILAG LTD,38485993,�4.38,30 g Pack MICONAZOLE Nitrate Cream 2%,HP14 4HJ, , , , ,207929448,930753380
Department of Health,Solent NHS Trust,30/06/2021,Stocks Raw Materials,Balance Sheet,JANSSEN CILAG LTD,38485993,�856.56,50 mg Vial RISPERIDONE Injection 50mg,HP14 4HJ, , , , ,207929448,930753380
Department of Health,Solent NHS Trust,30/06/2021,Stocks Raw Materials,Balance Sheet,JANSSEN CILAG LTD,38485993,�54.14,6 Pre-filled Syringe Pack EPOETIN Alfa (Eprex) Injection Syringe 4000units in 0.4mL,HP14 4HJ, , , , ,207929448,930753380
Department of Health,Solent NHS Trust,30/06/2021,AUC Additions,Balance Sheet,KONE PLC,38444843,"�138,016.71",SM Hospital Lift 2 (KA) T-0004270561 - V8,KT16 9HW, , , , ,222279969,H229627386
Department of Health,Solent NHS Trust,30/06/2021,Drugs,HIV Outpatients,LLOYDS PHARMACY LTD,38659031,"-�1,428.60",https://nww.einvoice-prod.sbs.nhs.uk:8179/invoicepdf/3f0d1b4b-2d0d-5b65-bf12-43cfd03ca62f,CV2 2TX, , , , ,222516987,100565
Department of Health,Solent NHS Trust,30/06/2021,Drugs,HIV Outpatients,LLOYDS PHARMACY LTD,38659031,"-�29,797.16",,CV2 2TX, , , , ,222516987,100565
Department of Health,Solent NHS Trust,30/06/2021,Drugs,HIV Drugs,LLOYDS PHARMACY LTD,38686716,"�721,919.66",,CV2 2TX, , , , ,222516987,100564
Department of Health,Solent NHS Trust,30/06/2021,Drugs,HIV Outpatients,LLOYDS PHARMACY LTD,38686716,"�3,109.51",https://nww.einvoice-prod.sbs.nhs.uk:8179/invoicepdf/5d3d5003-8185-53b4-bfae-50393694ede5,CV2 2TX, , , , ,222516987,100564
Department of Health,Solent NHS Trust,30/06/2021,Contr Other External,Aldershot HC,NHS PROPERTY SERVICES LTD,38444725,"�4,587.99",https://nww.einvoice-prod.sbs.nhs.uk:8179/invoicepdf/2af031f6-11a6-5f2f-8c80-0fdc222295a3,EC2V 7NG, , , , ,156725100,H440704
Department of Health,Solent NHS Trust,30/06/2021,Service Charge,Aldershot HC,NHS PROPERTY SERVICES LTD,38444725,"�22,243.76",,EC2V 7NG, , , , ,156725100,H440704
Department of Health,Solent NHS Trust,30/06/2021,Lease Rents,Aldershot HC,NHS PROPERTY SERVICES LTD,38497131,"�112,765.71",,EC2V 7NG, , , , ,156725100,H440445
Department of Health,Solent NHS Trust,30/06/2021,Rates,Aldershot HC,NHS PROPERTY SERVICES LTD,38497131,"�5,665.71",https://nww.einvoice-prod.sbs.nhs.uk:8179/invoicepdf/8cdace43-f6f0-5f3b-a8b2-4f7f0e396ec6,EC2V 7NG, , , , ,156725100,H440445
Department of Health,Solent NHS Trust,30/06/2021,CNST - NHS Resolution,Corporate Support,NHS RESOLUTION,38567664,"-�80,523.30",AP REFUND,E14 4PU, , , , ,654967486,SICX404780CR
Department of Health,Solent NHS Trust,30/06/2021,LTPS - NHS Resolution,Corporate Support,NHS RESOLUTION,38567664,"-�8,268.10",AP REFUND,E14 4PU, , , , ,654967486,SICX404780CR
Department of Health,Solent NHS Trust,30/06/2021,PES - NHS Resolution,Corporate Support,NHS RESOLUTION,38567664,"-�1,304.30",AP REFUND,E14 4PU, , , , ,654967486,SICX404780CR
Department of Health,Solent NHS Trust,30/06/2021,Lease Rents,HQ Highpoint Centre,PLUS YOU LTD,38526619,"�15,413.48",21.22 Rent and Service charge Highpoint,SO19 8BR, , , , ,100178858,4819
Department of Health,Solent NHS Trust,30/06/2021,Lease Rents,HQ Highpoint Centre,PLUS YOU LTD,38526619,"�3,082.69",https://nww.einvoice-prod.sbs.nhs.uk:8179/invoicepdf/e72d787e-6895-53b6-98f4-565130bf2fc4,SO19 8BR, , , , ,100178858,4819
Department of Health,Solent NHS Trust,30/06/2021,Service Charge,HQ Highpoint Centre,PLUS YOU LTD,38526619,"�28,625.04",21.22 Rent and Service charge Highpoint,SO19 8BR, , , , ,100178858,4819
Department of Health,Solent NHS Trust,30/06/2021,Service Charge,HQ Highpoint Centre,PLUS YOU LTD,38526619,"�5,725.01",https://nww.einvoice-prod.sbs.nhs.uk:8179/invoicepdf/e72d787e-6895-53b6-98f4-565130bf2fc4,SO19 8BR, , , , ,100178858,4819
Department of Health,Solent NHS Trust,30/06/2021,Drugs,SRH Isle of Wight,PORTSMOUTH HOSPITALS UNIVERSITY NHS TRUST,38436604,"�35,531.90",JAC RECHARGE,PO6 3LY, , , , ,,9419511
Department of Health,Solent NHS Trust,30/06/2021,NHS Accruals,Balance Sheet,PORTSMOUTH HOSPITALS UNIVERSITY NHS TRUST,38569155,"�59,337.88",PROVIDER TO PROVIDER (DEBTOR),PO6 3LY, , , , ,,9423719
Department of Health,Solent NHS Trust,30/06/2021,NHS Accruals,Balance Sheet,PORTSMOUTH HOSPITALS UNIVERSITY NHS TRUST,38700765,"�199,074.92",NHS RENTAL REVENUE PROVIDER TO PROVIDER,PO6 3LY, , , , ,,9423605
Department of Health,Solent NHS Trust,30/06/2021,Foundation Programme - F1,CAMHS & Psychology East,PORTSMOUTH HOSPITALS UNIVERSITY NHS TRUST,38631655,"�3,041.80",,PO6 3LY,, , , ,,9422120
Department of Health,Solent NHS Trust,30/06/2021,Foundation Programme - F1,Orchard Therapies and Admin,PORTSMOUTH HOSPITALS UNIVERSITY NHS TRUST,38631655,"�3,822.94",,PO6 3LY,, , , ,,9422120
Department of Health,Solent NHS Trust,30/06/2021,Foundation Programme - F2,CAMHS & Psychology East,PORTSMOUTH HOSPITALS UNIVERSITY NHS TRUST,38631655,"�4,839.71",,PO6 3LY,, , , ,,9422120
Department of Health,Solent NHS Trust,30/06/2021,Foundation Programme - F2,The Kite Unit,PORTSMOUTH HOSPITALS UNIVERSITY NHS TRUST,38631655,"�4,711.39",STAFF INCOME NHS,PO6 3LY,, , , ,,9422120
Department of Health,Solent NHS Trust,30/06/2021,GP Trainee,Orchard Therapies and Admin,PORTSMOUTH HOSPITALS UNIVERSITY NHS TRUST,38631655,"�19,269.52",,PO6 3LY,, , , ,,9422120
Department of Health,Solent NHS Trust,30/06/2021,GP Trainee,Portsmouth Commun Sub Mis,PORTSMOUTH HOSPITALS UNIVERSITY NHS TRUST,38631655,"�4,577.52",STAFF INCOME NHS,PO6 3LY,, , , ,,9422120
Department of Health,Solent NHS Trust,30/06/2021,Foundation Programme - F1,CAMHS & Psychology East,PORTSMOUTH HOSPITALS UNIVERSITY NHS TRUST,38631682,"�3,048.64",,PO6 3LY,, , , ,,9423588
Department of Health,Solent NHS Trust,30/06/2021,Foundation Programme - F1,Orchard Therapies and Admin,PORTSMOUTH HOSPITALS UNIVERSITY NHS TRUST,38631682,"�2,990.36",,PO6 3LY,, , , ,,9423588
Department of Health,Solent NHS Trust,30/06/2021,Foundation Programme - F2,CAMHS & Psychology East,PORTSMOUTH HOSPITALS UNIVERSITY NHS TRUST,38631682,"�3,477.39",,PO6 3LY,, , , ,,9423588
Department of Health,Solent NHS Trust,30/06/2021,Foundation Programme - F2,The Kite Unit,PORTSMOUTH HOSPITALS UNIVERSITY NHS TRUST,38631682,"�3,477.39",STAFF INCOME NHS,PO6 3LY,, , , ,,9423588
Department of Health,Solent NHS Trust,30/06/2021,GP Trainee,Orchard Therapies and Admin,PORTSMOUTH HOSPITALS UNIVERSITY NHS TRUST,38631682,"�19,236.33",,PO6 3LY,, , , ,,9423588
Department of Health,Solent NHS Trust,30/06/2021,GP Trainee,Portsmouth Commun Sub Mis,PORTSMOUTH HOSPITALS UNIVERSITY NHS TRUST,38631682,"�4,577.52",STAFF INCOME NHS,PO6 3LY,, , , ,,9423588
Department of Health,Solent NHS Trust,30/06/2021,"Books, Journals & Subscr",CAMHS & Psychology East,SILVERCLOUD HEALTH LTD,38575188,"�13,926.00",Annual platform subscription for period 1.4.21-31.3.22. split cost 50:50 for Portsmouth & Southampton CYP & CAMHS Services,XXX XXX, , , , ,IE9822219R,10002
Department of Health,Solent NHS Trust,30/06/2021,"Books, Journals & Subscr",CAMHS & Psychology West,SILVERCLOUD HEALTH LTD,38575188,"�13,926.00",Annual platform subscription for period 1.4.21-31.3.22. split cost 50:50 for Portsmouth & Southampton CYP & CAMHS Services,XXX XXX, , , , ,IE9822219R,10002
Department of Health,Solent NHS Trust,30/06/2021,Contractual Clinical Srv,AMH Community Team,SOLENT MIND,38484576,"�46,642.58",Portsmouth Support & Recovery Contract 21-22,SO17 1XF, , , , ,,INV008242
Department of Health,Solent NHS Trust,30/06/2021,Contr Other External,Veterans MH Project,SOLENT MIND,38186047,"�28,700.00",Solent Mind- Armed Forces Grant 2020/2021,SO17 1XF,, , , ,,INV008208
Department of Health,Solent NHS Trust,30/06/2021,Voluntary Sector,Veterans MH Project,SOLENT MIND,38186047,"�12,345.00",Armed Forces Grant 2020/21,SO17 1XF,, , , ,,INV008208
Department of Health,Solent NHS Trust,30/06/2021,Voluntary Sector,SRH Isle of Wight,TERRENCE HIGGINS TRUST,38702860,"�26,865.20",THT NHS Solent PrEP Work,WC1X 8DP, , , , ,564614042,27003526
Department of Health,Solent NHS Trust,30/06/2021,Voluntary Sector,SRH North,TERRENCE HIGGINS TRUST,38702860,"�3,609.60",THT NHS Solent PrEP Work,WC1X 8DP, , , , ,564614042,27003526
Department of Health,Solent NHS Trust,30/06/2021,Voluntary Sector,SRH South,TERRENCE HIGGINS TRUST,38702860,"�16,525.20",THT NHS Solent PrEP Work,WC1X 8DP, , , , ,564614042,27003526
Department of Health,Solent NHS Trust,30/06/2021,AUC Additions,Balance Sheet,TNG CONSULTING ENGINEERS LTD,38459733,"�22,956.60",Programme Management Services Geoff Lewis  J2190506/Fee/24/GL/AD/JP  April  June 2021,SO15 2EW, , , , ,GB737 0400 59,14279
Department of Health,Solent NHS Trust,30/06/2021,Mobile Phones,ICT,VODAFONE CORPORATE LTD,38686723,"�50,143.21",,RG14 5FF, , , , ,569953277,98325298
Department of Health,Solent NHS Trust,30/06/2021,Computer Software/License,Corona Virus Costs,WAZOKU LTD,38243389,"-�6,000.00",https://nww.einvoice-prod.sbs.nhs.uk:8179/invoicepdf/1b65d197-c338-5f0e-bc06-cc8052eed0b9,EC3R 6HD, , , , ,GB 114 4628 34,1303
Department of Health,Solent NHS Trust,30/06/2021,Computer Software/License,Trust Board,WAZOKU LTD,38243389,"�30,000.00",Wazoku Ideas Platform - Yr 2 costs,EC3R 6HD, , , , ,GB 114 4628 34,1303
Department of Health,Solent NHS Trust,30/06/2021,Computer Software/License,Trust Board,WAZOKU LTD,38243389,"�6,000.00",https://nww.einvoice-prod.sbs.nhs.uk:8179/invoicepdf/1b65d197-c338-5f0e-bc06-cc8052eed0b9,EC3R 6HD, , , , ,GB 114 4628 34,1303
Department of Health,Solent NHS Trust,30/06/2021,AUC Additions,Balance Sheet,WEST END ROOFING & CONSTRUCTION LTD,38536714,"�73,292.06",For the sum of:,SO31 4RF, , , , ,6315405063,33287
Department of Health,Solent NHS Trust,30/06/2021,AUC Additions,Balance Sheet,WEST END ROOFING & CONSTRUCTION LTD,38608227,"�140,326.02",SMCH Block A roof enabling works and Chiller installation as per their tender submission (KA),SO31 4RF, , , , ,6315405063,33295
